serial_NO,outcome,severity of COVID-19,age,sex,Systolic pressure,diastolic pressure,smoking,drinking,Diabetes,Hypertension,Hyperlipidemia,Heart disease,Cancer,COPD,Tuberculosis,Chronic kidney disease,Liver disease,Intracerebral hemorrhage,Asthma,Fever,Cough,Hemoptysis,Muscle soreness,Fatigue,Running nose,Pharyngalgia,Shortness of breath,Chest pain,Anorexia,Nausea and vomiting,Diarrhea,Stomachache,Deadache,Dizziness,Disturbance of consciousness,MRS,prior stroke,AIS,"Duration of hospital stay, days",Death,MRS groups,BWC,LC,Platelets,Haemoglobin,Albumin,ALT,Prothrombin time,D-D dimer
78560,死亡,轻型,90,0,,,0,0,0,1,0,0,0,0,0,0,0,0,0,0,0,0,0,0,0,0,0,0,0,0,0,0,0,0,0,5.0,1,0,66,1,3.0,1.0,2.0,1.0,1.0,0.0,0.0,0.0,3.0
1615592,,普通型,85,0,176.0,93.0,0,0,0,0,0,0,0,0,0,0,0,0,0,0,0,0,0,0,0,0,0,0,0,0,0,0,0,0,0,,0,0,109,0,,3.0,1.0,1.0,2.0,0.0,0.0,,3.0
103220773,,轻型,52,1,120.0,70.0,0,0,0,0,0,0,0,0,0,0,0,0,0,0,0,0,0,0,0,0,0,0,0,0,0,0,0,0,0,,0,0,0,0,,,2.0,1.0,2.0,1.0,0.0,0.0,1.0
1937335-1,死亡,重型,71,1,128.0,78.0,0,0,0,1,0,0,0,0,0,0,0,1,0,0,0,0,0,0,0,0,0,0,0,0,0,0,0,0,1,5.0,1,0,72,1,3.0,,1.0,1.0,1.0,0.0,0.0,0.0,3.0
79476,死亡,轻型,75,0,,,0,0,1,1,0,1,0,0,0,0,0,0,0,0,0,0,0,1,0,0,0,0,0,0,0,0,0,0,0,,0,0,52,1,,2.0,2.0,1.0,2.0,1.0,0.0,,
ZY010001393276,,普通型,49,0,,,0,0,0,0,0,0,1,0,0,0,0,0,0,0,0,0,0,0,0,0,0,0,0,0,0,0,0,0,0,,0,0,49,0,,2.0,2.0,1.0,2.0,1.0,0.0,0.0,1.0
6421163,死亡,普通型,65,1,130.0,77.0,0,0,1,1,0,1,0,0,0,0,0,0,0,0,0,0,0,0,0,0,1,0,0,1,0,0,0,0,0,,0,0,47,1,,2.0,1.0,1.0,1.0,0.0,0.0,,3.0
6421458,,普通型,44,1,125.0,70.0,0,0,0,0,0,0,0,0,0,0,0,0,0,0,0,0,0,0,0,0,0,0,0,0,0,0,0,0,0,,0,0,87,0,,2.0,1.0,1.0,1.0,1.0,0.0,1.0,3.0
6421516,死亡,重型,75,1,124.0,84.0,0,0,0,1,0,0,1,0,0,0,0,0,0,0,1,0,0,0,0,0,0,0,0,1,0,0,0,0,0,,0,0,39,1,,,,,,,,,
6421566,,重型,74,1,,,0,0,0,0,0,0,0,0,0,0,0,0,0,0,0,0,0,0,0,0,0,0,0,0,0,0,0,0,0,,0,0,49,0,,,,,,,,,
6421719,死亡,普通型,70,0,105.0,68.0,0,0,0,0,0,0,0,0,0,0,0,0,0,0,0,0,0,0,0,0,0,0,0,0,0,0,0,0,0,,0,0,64,1,,2.0,2.0,1.0,2.0,1.0,0.0,0.0,
452108,,危重型,58,1,,,1,1,1,0,0,1,0,0,0,0,0,0,0,0,0,0,0,0,0,0,0,0,0,0,0,0,0,0,1,3.0,1,1,75,0,2.0,2.0,2.0,1.0,3.0,1.0,0.0,0.0,1.0
ZY010001395051,,重型,40,1,,,0,0,0,0,0,0,0,0,0,0,0,0,0,1,1,0,0,0,0,0,0,0,0,0,0,0,0,0,0,,0,0,8,0,,2.0,2.0,1.0,3.0,1.0,1.0,0.0,1.0
ZY010001395129,死亡,重型,82,1,,,0,0,0,0,0,0,1,0,0,1,0,0,0,0,0,0,0,0,0,0,0,0,0,0,0,0,0,0,0,,0,0,42,1,,,1.0,1.0,1.0,1.0,1.0,0.0,3.0
6422011,死亡,普通型,60,1,109.0,53.0,0,0,0,0,0,0,0,0,0,0,0,0,0,0,0,0,0,0,0,0,0,1,0,0,0,0,0,0,0,,0,0,52,1,,2.0,2.0,0.0,1.0,0.0,0.0,,3.0
6422163,死亡,重型,63,0,121.0,74.0,0,0,0,0,0,0,0,0,0,0,0,0,0,0,0,0,0,0,0,0,0,0,0,0,1,0,0,0,0,,0,0,67,1,,2.0,1.0,1.0,1.0,0.0,0.0,,3.0
ZY010001395914,,普通型,22,0,,,0,0,0,0,0,0,0,0,0,0,0,0,0,1,1,0,0,0,0,0,0,0,0,0,0,0,0,0,0,,0,0,5,0,,,1.0,1.0,3.0,1.0,0.0,0.0,1.0
6422378,死亡,普通型,51,1,93.0,58.0,0,0,0,0,0,0,0,0,0,0,0,0,0,0,0,0,0,0,0,0,0,0,0,0,0,0,0,0,0,,0,0,51,1,,,,,,,,,
1013,死亡,普通型,65,1,160.0,90.0,0,0,0,1,0,0,1,0,0,0,0,0,0,1,1,0,0,0,0,0,0,0,0,0,0,0,0,0,0,,0,0,40,1,,3.0,2.0,1.0,3.0,1.0,0.0,0.0,2.0
1621717,死亡,普通型,56,1,96.0,63.0,0,0,0,0,0,0,0,0,0,0,0,0,0,0,0,0,0,0,0,0,0,0,0,0,0,0,0,0,0,,0,0,51,1,,3.0,,0.0,1.0,0.0,0.0,0.0,3.0
ZY010000229292,,重型,41,1,86.0,145.0,1,0,0,0,0,0,0,0,0,1,0,0,0,1,1,0,0,1,0,0,1,0,0,0,0,0,0,0,0,,0,0,19,0,,,2.0,1.0,3.0,0.0,1.0,,3.0
ZY010000229296,,普通型,40,1,85.0,135.0,1,0,0,0,0,0,0,0,0,0,0,0,0,1,1,0,0,1,0,0,0,0,0,0,0,0,0,1,0,,0,0,19,0,,,2.0,1.0,3.0,0.0,1.0,,
ZY010000229297,,普通型,53,0,70.0,110.0,1,0,0,0,0,0,0,0,0,0,0,0,0,1,1,0,0,1,0,0,1,0,1,0,0,0,1,0,0,,0,0,10,0,,,2.0,1.0,3.0,0.0,0.0,,2.0
ZY010000229317,,重型,50,0,65.0,135.0,1,0,0,0,0,0,0,0,0,0,0,0,0,1,1,0,0,1,0,0,1,0,0,0,0,0,0,0,0,,0,0,18,0,,,,,,,,,
ZY010000229319,,危重型,33,1,72.0,123.0,1,0,0,0,0,0,0,0,0,0,0,0,0,1,1,0,0,0,0,0,0,0,0,0,0,0,0,0,0,,0,0,17,0,,2.0,1.0,1.0,3.0,0.0,1.0,,2.0
ZY010000229326,,普通型,43,1,85.0,156.0,1,0,0,0,0,0,0,0,0,0,0,0,0,1,1,0,0,0,0,0,1,0,0,0,0,0,0,0,0,,0,0,12,0,,2.0,2.0,1.0,3.0,1.0,0.0,,1.0
ZY010000229327,,普通型,44,1,65.0,99.0,1,0,0,0,0,0,0,0,1,0,0,0,0,1,1,0,0,0,0,0,0,0,0,0,0,0,0,0,0,,0,0,17,0,,,2.0,1.0,3.0,1.0,0.0,,1.0
ZY010000229331,,重型,63,1,83.0,166.0,1,0,1,1,0,0,0,0,0,0,0,0,0,0,1,0,0,0,0,0,1,0,0,0,0,0,0,0,0,2.0,1,0,13,0,2.0,3.0,1.0,1.0,3.0,0.0,1.0,,1.0
ZY010000229332,,危重型,63,0,89.0,192.0,1,0,0,0,0,0,0,0,0,0,0,0,0,1,1,0,0,1,0,0,0,0,0,0,0,0,0,0,0,,0,0,10,0,,,,,,,,,
1605903-6,,普通型,58,1,125.0,78.0,1,1,0,0,0,0,0,1,0,0,0,0,0,0,0,0,0,1,0,0,0,0,0,1,0,0,0,1,0,,0,0,37,0,,2.0,2.0,1.0,3.0,1.0,0.0,0.0,2.0
ZY010001394010,,普通型,58,1,,,0,0,0,0,0,0,1,0,0,0,0,0,0,0,0,0,0,0,0,0,0,1,0,0,0,0,0,0,0,,0,0,29,0,,2.0,2.0,1.0,3.0,1.0,0.0,0.0,1.0
ZY010001396425,死亡,危重型,62,1,,,0,0,0,0,0,0,1,0,0,0,0,0,0,0,0,0,0,0,0,0,0,0,0,0,0,0,0,0,0,,0,0,50,1,,1.0,1.0,0.0,1.0,0.0,0.0,0.0,2.0
ZY010000229425,,重型,57,1,85.0,152.0,1,1,1,0,0,0,0,0,0,0,1,0,0,1,1,0,0,1,0,0,1,0,1,0,0,0,0,0,0,,0,0,16,0,,,2.0,1.0,3.0,0.0,0.0,,1.0
ZY010000229434,,普通型,58,1,88.0,130.0,1,0,0,1,0,0,0,0,0,0,1,0,0,0,1,0,0,0,0,0,0,0,0,0,0,0,0,0,0,,0,0,9,0,,,,,,,,,
ZY010000229455,,普通型,52,1,76.0,125.0,1,0,0,0,0,0,0,0,0,0,0,0,0,1,1,0,0,0,0,0,0,0,0,0,0,0,0,0,0,,0,0,9,0,,,,,,,,,
ZY010000229468,,普通型,56,0,92.0,129.0,1,0,0,0,0,0,0,0,0,0,0,0,0,1,1,0,0,0,0,0,0,0,0,0,0,0,0,0,0,,0,0,9,0,,,,,,,,,
ZY010000229472,,普通型,52,1,56.0,123.0,0,0,0,0,0,0,0,0,0,0,0,0,0,1,1,0,0,0,0,0,0,0,0,0,0,0,0,0,0,,0,0,17,0,,,1.0,1.0,3.0,0.0,0.0,,2.0
ZY010000229476,,重型,53,1,75.0,119.0,0,0,0,0,0,0,0,0,0,0,0,0,0,1,1,0,0,0,0,0,0,0,0,0,0,0,0,0,0,,0,0,20,0,,,1.0,1.0,3.0,1.0,1.0,,1.0
ZY010001396625,死亡,危重型,60,1,,,0,0,0,0,0,0,0,0,0,0,0,0,0,1,0,0,0,0,0,0,0,0,0,0,0,0,0,0,0,,0,0,53,1,,2.0,1.0,1.0,2.0,0.0,0.0,0.0,2.0
ZY010000229523,,普通型,43,1,75.0,115.0,0,0,0,0,0,0,0,0,0,0,0,0,0,1,1,0,0,1,0,0,0,0,0,0,0,0,0,0,0,,0,0,16,0,,2.0,2.0,1.0,3.0,0.0,0.0,,1.0
ZY010000229548,,普通型,50,1,82.0,129.0,0,0,0,0,0,0,0,0,0,0,0,0,0,0,1,0,0,0,0,0,1,0,0,0,0,0,0,0,0,,0,0,10,0,,,2.0,1.0,3.0,0.0,0.0,,3.0
ZY010000229552,死亡,危重型,76,1,56.0,94.0,0,0,0,0,0,0,0,0,1,0,0,0,0,1,1,0,0,0,0,0,0,0,0,0,0,0,0,0,0,,0,0,15,1,,,1.0,1.0,3.0,0.0,0.0,,2.0
ZY010000229556,,普通型,55,0,76.0,118.0,0,0,0,0,0,0,0,0,0,0,0,0,0,1,1,0,0,0,0,0,0,0,0,0,0,0,0,0,0,,0,0,14,0,,,1.0,1.0,3.0,0.0,0.0,,1.0
ZY010000229565,,重型,42,1,105.0,169.0,1,0,0,0,0,0,0,0,0,0,0,0,0,1,1,0,0,0,0,0,1,0,0,0,0,0,0,0,0,,0,0,18,0,,,2.0,1.0,3.0,0.0,0.0,,2.0
ZY010000229582,,普通型,43,0,72.0,112.0,0,0,0,0,0,0,0,0,0,0,0,0,0,1,1,0,0,0,0,0,0,0,0,0,0,0,0,0,0,,0,0,12,0,,,1.0,1.0,3.0,0.0,0.0,,1.0
00419630,,轻型,44,1,,,0,0,0,0,0,0,0,0,0,0,0,0,0,0,0,0,0,0,0,0,0,0,0,0,0,0,0,0,0,,0,0,57,0,,,,,,,,,
00419625,,轻型,56,1,,,0,0,0,0,0,0,0,0,0,0,0,0,0,0,0,0,0,0,0,0,0,0,0,0,0,0,0,0,0,,0,0,57,0,,,,,,,,,
ZY010000229635,,普通型,54,1,66.0,110.0,0,0,0,0,0,0,0,0,0,0,1,0,0,1,1,0,0,0,0,0,0,0,0,0,0,0,0,0,0,,0,0,14,0,,,1.0,1.0,3.0,0.0,0.0,,1.0
6422858,,危重型,72,1,140.0,75.0,0,0,0,0,0,0,0,0,0,0,0,0,0,0,0,0,0,0,0,0,0,0,0,0,0,0,0,0,0,,0,0,65,0,,2.0,1.0,0.0,3.0,0.0,0.0,0.0,3.0
ZY010000229651,,普通型,48,0,75.0,122.0,0,0,0,0,0,0,0,0,0,0,0,0,0,1,1,0,0,0,0,1,0,0,0,0,0,0,0,0,0,,0,0,9,0,,,1.0,0.0,3.0,0.0,0.0,,1.0
ZY010000229655,,普通型,47,1,70.0,118.0,1,0,0,0,1,0,0,0,0,0,0,0,0,1,1,0,0,0,0,0,0,0,0,0,0,0,0,0,0,,0,0,15,0,,,2.0,1.0,3.0,1.0,0.0,,1.0
201912310591,死亡,危重型,77,0,,,0,0,0,1,0,0,0,0,0,0,0,0,0,0,0,0,0,0,0,0,0,0,0,0,0,0,0,0,0,,0,0,31,1,,2.0,2.0,1.0,3.0,1.0,0.0,0.0,3.0
ZY010000229669,,普通型,52,0,75.0,119.0,1,0,0,0,0,0,0,0,0,0,0,0,0,1,1,0,0,0,0,0,0,0,0,0,0,0,0,0,0,,0,0,11,0,,,1.0,1.0,2.0,0.0,0.0,,3.0
ZY010000229673,,普通型,47,1,71.0,118.0,1,0,0,0,0,0,0,0,0,0,0,0,0,1,1,0,0,1,0,0,0,0,0,0,0,0,0,0,0,,0,0,13,0,,,,,,,,,
ZY010000229682,死亡,普通型,49,0,86.0,135.0,1,0,1,0,0,0,0,0,0,0,0,0,0,1,1,0,0,1,0,0,1,0,0,0,0,0,0,0,0,0.0,1,0,20,1,1.0,,,,,,,,
ZY010000229683,死亡,危重型,66,1,76.0,123.0,1,0,1,0,0,0,0,0,0,1,1,0,0,1,1,0,0,0,0,0,1,0,0,0,0,0,0,0,0,,0,0,30,1,,,,,,,,,
00419679,,轻型,71,1,90.0,150.0,0,0,0,0,0,0,0,0,0,0,0,0,0,0,0,0,0,0,0,0,0,0,0,0,0,0,0,0,0,,0,0,57,0,,,,,,,,,
ZY010000229689,,普通型,70,0,75.0,119.0,1,0,0,1,0,0,0,0,0,0,0,0,0,0,1,0,0,0,0,0,0,0,0,0,0,0,0,0,0,,0,0,16,0,,,2.0,1.0,3.0,0.0,0.0,,1.0
ZY010000229698,,普通型,53,1,86.0,144.0,1,1,0,0,0,0,0,0,0,0,0,0,0,1,1,0,0,0,0,0,1,0,0,0,0,0,0,0,0,,0,0,11,0,,,,,,,,,
ZY010001396973,死亡,普通型,68,0,,,0,0,0,0,0,0,0,0,0,0,0,0,0,0,1,0,0,0,0,0,1,0,0,1,0,0,0,0,0,,0,0,29,1,,2.0,2.0,1.0,3.0,1.0,0.0,0.0,1.0
ZY010000229704,,普通型,49,1,78.0,125.0,0,0,0,0,0,0,0,0,0,0,0,0,0,1,1,0,0,0,0,0,1,0,0,0,0,0,0,1,0,,0,0,8,0,,,,,,,,,
ZY010000229705,,普通型,45,1,75.0,119.0,1,0,0,0,0,0,0,0,0,1,0,0,0,1,0,0,0,0,0,0,0,0,0,0,0,0,0,0,0,,0,0,28,0,,,2.0,1.0,3.0,0.0,1.0,,3.0
ZY010000229706,,普通型,51,1,80.0,114.0,1,0,0,0,0,0,0,0,0,1,0,0,0,1,1,0,0,0,0,0,0,0,0,0,0,0,0,0,0,,0,0,12,0,,,2.0,1.0,3.0,0.0,0.0,,1.0
ZY010000229721,,普通型,45,1,83.0,123.0,0,0,0,0,0,0,0,0,0,0,1,0,0,1,1,0,0,0,0,0,0,0,0,0,0,0,0,0,0,,0,0,14,0,,,1.0,0.0,3.0,0.0,0.0,,1.0
ZY010000229729,,普通型,57,1,80.0,126.0,1,0,1,0,0,0,0,0,0,1,0,0,0,1,0,0,0,0,0,0,0,0,0,0,0,0,0,0,0,,0,0,28,0,,,1.0,1.0,2.0,0.0,0.0,,1.0
ZY010000229731,,危重型,49,0,75.0,122.0,0,0,0,0,0,0,0,0,0,0,0,0,0,1,1,0,0,0,0,0,0,0,0,0,0,0,0,0,0,,0,0,16,0,,,1.0,1.0,2.0,1.0,0.0,,1.0
ZY010000229734,,普通型,45,0,76.0,121.0,0,0,0,0,0,0,0,0,0,0,0,0,0,1,1,0,0,0,0,0,0,0,0,0,0,0,0,0,0,,0,0,14,0,,,,,,,,,
ZY010000229743,,重型,54,0,75.0,119.0,1,0,0,0,0,0,0,0,0,1,1,0,0,1,1,0,0,0,0,0,0,0,0,0,0,0,0,0,0,,0,0,16,0,,,2.0,1.0,2.0,0.0,0.0,,1.0
ZY010000229748,,普通型,39,0,75.0,122.0,0,0,0,0,0,0,0,0,0,0,0,0,0,1,1,0,0,1,0,0,0,0,0,0,0,0,0,0,0,,0,0,12,0,,,2.0,1.0,2.0,0.0,0.0,,3.0
ZY010000229751,,普通型,44,1,75.0,125.0,0,0,0,0,0,0,0,0,0,0,0,0,0,1,1,0,0,0,0,0,0,0,0,0,0,0,0,0,0,,0,0,11,0,,,2.0,1.0,3.0,1.0,0.0,,2.0
ZY010000229752,,普通型,48,1,85.0,122.0,1,0,0,0,0,0,0,0,0,0,0,0,0,1,1,0,0,0,0,0,1,0,0,0,0,0,0,0,0,,0,0,12,0,,,2.0,1.0,3.0,0.0,0.0,,3.0
ZY010000229755,,普通型,57,0,71.0,119.0,1,0,0,0,0,0,0,0,0,1,0,0,0,1,0,0,0,0,0,0,0,0,0,0,0,0,0,0,0,,0,0,8,0,,,2.0,1.0,3.0,1.0,0.0,,3.0
ZY010000229757,,普通型,33,1,86.0,124.0,1,0,0,0,0,0,0,0,0,1,0,0,0,1,0,0,0,0,0,0,0,0,0,0,0,0,1,0,0,,0,0,12,0,,,2.0,1.0,3.0,1.0,0.0,,1.0
ZY010000229759,,危重型,58,0,75.0,97.0,1,0,0,0,0,0,0,0,0,1,0,0,0,1,0,0,0,0,0,0,1,0,0,0,0,0,0,0,0,,0,0,18,0,,,,,,,,,
ZY010000229761,,普通型,30,1,79.0,130.0,1,0,0,0,0,0,0,0,0,1,0,0,0,1,0,0,0,0,0,0,0,0,0,0,0,0,0,0,0,,0,0,18,0,,2.0,1.0,1.0,3.0,1.0,1.0,,1.0
ZY010000229762,,普通型,51,1,104.0,173.0,0,0,0,1,0,0,0,0,0,0,0,0,0,1,1,0,0,0,0,0,0,0,0,0,0,0,0,0,0,,0,0,15,0,,,2.0,1.0,3.0,0.0,1.0,,3.0
ZY010000229771,,重型,70,1,75.0,119.0,1,0,0,0,0,0,0,0,0,1,0,0,0,1,0,0,0,0,0,0,0,0,0,0,0,0,0,0,0,,0,0,11,0,,,2.0,1.0,2.0,0.0,0.0,,3.0
ZY010000229782,,重型,57,0,67.0,167.0,0,0,0,1,0,0,0,0,0,0,0,0,0,1,0,0,0,0,1,0,0,0,0,0,0,0,0,0,0,4.0,1,0,23,0,3.0,,2.0,1.0,2.0,1.0,0.0,,1.0
ZY010000229783,死亡,重型,62,1,86.0,167.0,0,0,0,0,0,0,0,0,0,0,0,0,0,1,1,0,0,0,0,0,1,0,0,0,0,0,1,0,1,,0,0,9,1,,,,,,,,,
ZY010000229788,,重型,79,1,75.0,119.0,1,0,0,0,0,0,1,0,0,1,0,0,0,1,0,0,0,0,0,0,1,0,0,0,0,0,0,0,0,,0,0,17,0,,,,,,,,,
ZY010000229789,,普通型,50,1,75.0,119.0,1,0,0,0,0,0,0,0,0,1,0,0,0,1,0,0,0,0,0,0,0,0,0,0,0,0,0,0,0,,0,0,11,0,,3.0,2.0,1.0,3.0,0.0,1.0,,
ZY010000229790,,普通型,49,0,75.0,119.0,1,0,0,0,0,0,0,0,0,1,0,0,0,1,0,0,0,0,0,0,1,0,0,0,0,0,0,0,0,,0,0,11,0,,2.0,2.0,1.0,3.0,1.0,0.0,,2.0
ZY010000229794,,重型,58,1,89.0,143.0,0,0,1,1,0,0,0,0,0,0,0,0,0,1,1,0,0,0,1,0,0,0,0,0,0,0,0,0,0,,0,0,15,0,,,,,,,,,
ZY010000229832,,普通型,39,1,75.0,121.0,1,0,0,0,0,0,0,0,0,0,0,0,0,1,1,0,0,0,0,0,0,0,0,0,0,0,0,0,0,,0,0,11,0,,,2.0,1.0,3.0,1.0,0.0,,1.0
33837-1,,普通型,51,1,112.0,76.0,0,0,0,0,0,0,0,0,0,0,0,0,0,0,0,0,0,0,0,0,0,0,0,0,0,0,0,0,0,,0,0,56,0,,,,,,,,,
ZY010000229863,,普通型,46,1,80.0,128.0,1,0,0,0,0,0,0,0,0,0,0,0,0,1,1,0,0,1,0,0,1,1,0,0,0,0,0,0,0,,0,0,17,0,,,1.0,1.0,3.0,1.0,0.0,,2.0
00419769,,轻型,58,1,92.0,188.0,0,0,0,0,0,0,0,0,0,0,0,1,0,1,0,0,0,0,0,0,1,0,0,0,0,0,0,0,1,,0,0,55,0,,,,,,,,,
00419775,,轻型,61,1,,,0,0,0,0,0,1,0,0,0,0,0,0,0,0,0,0,0,0,0,0,0,0,0,0,0,0,0,0,0,,0,0,56,0,,,,,,,,,
00419776,,普通型,68,1,,,0,0,1,1,0,0,0,0,0,0,0,0,0,0,0,0,0,0,0,0,0,0,0,0,0,0,0,0,0,,0,0,56,0,,,,,,,,,
00419778,,轻型,57,1,86.0,137.0,0,0,0,0,0,0,0,0,0,0,0,0,0,0,0,0,0,0,0,0,0,0,0,0,0,0,0,0,0,,0,0,56,0,,,,,,,,,
1339,死亡,重型,59,1,120.0,70.0,0,0,0,1,1,0,0,0,0,0,0,0,0,1,1,0,0,1,0,0,0,0,0,1,0,0,0,0,0,,0,0,17,1,,2.0,2.0,1.0,3.0,1.0,0.0,0.0,1.0
6423011,,重型,21,0,94.0,58.0,0,0,0,0,0,0,1,0,0,0,0,0,0,0,0,0,0,0,0,0,0,0,0,0,0,0,0,0,0,,0,0,35,0,,,,,,,,,
1622306,死亡,重型,57,0,,,0,0,0,0,0,0,0,0,0,0,0,1,0,0,0,0,0,0,0,0,0,0,0,0,0,0,0,0,1,,0,0,34,1,,,,,,,,,
ZY010000229893,,普通型,68,0,68.0,113.0,1,0,0,1,0,0,1,0,0,0,0,0,0,0,0,0,0,1,0,0,0,0,0,0,1,0,0,0,0,,0,0,25,0,,,1.0,0.0,3.0,0.0,0.0,,
ZY010000229901,,普通型,32,0,66.0,115.0,1,0,0,0,0,0,0,0,0,0,0,0,0,1,0,0,0,0,0,0,0,0,0,0,0,0,0,0,0,,0,0,8,0,,,1.0,1.0,2.0,1.0,0.0,,3.0
ZY010000229906,,普通型,53,1,71.0,132.0,0,0,0,0,0,0,0,0,0,0,0,0,0,1,0,0,0,0,0,0,0,0,0,0,0,0,0,0,0,,0,0,15,0,,,2.0,1.0,3.0,1.0,0.0,,2.0
ZY010000229909,,普通型,30,1,84.0,122.0,1,0,0,0,0,0,0,0,0,0,0,0,0,1,1,0,0,0,0,0,0,0,0,0,0,0,0,0,0,,0,0,13,0,,,,,,,,,
ZY010000229910,,重型,27,1,86.0,120.0,1,0,0,0,0,0,0,0,0,0,0,0,0,1,1,0,0,1,0,0,0,1,0,0,0,0,0,0,0,,0,0,14,0,,2.0,2.0,1.0,3.0,1.0,0.0,,2.0
ZY010000229920,,普通型,32,0,80.0,120.0,1,0,0,0,0,0,0,0,0,0,0,0,0,1,0,0,0,0,0,0,0,0,0,0,0,0,1,0,0,,0,0,15,0,,,,,,,,,
ZY010000229921,,重型,30,1,78.0,117.0,1,0,0,0,0,0,0,0,0,0,0,0,0,1,1,0,0,1,0,0,0,1,0,0,0,0,1,1,0,,0,0,15,0,,,2.0,1.0,3.0,1.0,0.0,,1.0
ZY010000229927,,普通型,56,1,68.0,110.0,1,0,0,1,0,0,0,0,0,0,0,0,0,1,0,0,0,0,0,0,0,0,0,0,0,0,0,0,0,,0,0,7,0,,1.0,1.0,1.0,3.0,0.0,0.0,,1.0
ZY010000229934,死亡,重型,45,1,59.0,91.0,1,0,0,0,0,0,0,0,0,0,0,0,0,1,1,0,0,1,0,0,1,0,0,0,1,0,0,0,0,,0,0,9,1,,,,,,,,,
ZY010000229935,,普通型,61,1,66.0,110.0,0,0,0,0,0,0,0,0,0,0,0,0,0,1,1,0,0,0,0,0,0,0,0,0,0,0,0,0,0,,0,0,17,0,,,,,,,,,
ZY010000229938,,普通型,44,1,70.0,110.0,1,0,0,0,0,0,0,0,0,0,0,0,0,1,1,0,0,0,0,0,0,0,0,0,0,0,0,0,0,,0,0,14,0,,,,,,,,,
ZY010000229943,,普通型,31,1,80.0,110.0,1,0,0,0,0,0,0,0,0,0,0,0,0,1,1,0,0,0,0,0,0,0,0,0,0,0,0,0,0,,0,0,8,0,,,2.0,1.0,3.0,0.0,1.0,,1.0
ZY010000229954,,普通型,50,1,70.0,120.0,1,0,0,0,0,0,0,0,0,0,0,0,0,1,0,0,0,0,0,0,0,0,0,0,0,0,0,0,0,,0,0,15,0,,,,,,,,,
ZY010000229955,,重型,68,0,68.0,118.0,1,0,0,1,0,0,0,0,0,0,0,0,0,1,1,0,0,0,0,0,0,0,0,0,0,0,0,0,0,,0,0,11,0,,,2.0,1.0,3.0,1.0,0.0,,1.0
ZY010000229958,,普通型,71,0,66.0,110.0,1,0,0,1,0,1,0,0,0,0,0,0,0,1,1,0,0,0,0,0,1,0,0,0,0,0,0,0,0,,0,0,11,0,,2.0,1.0,1.0,3.0,0.0,1.0,,2.0
ZY010000229960,,普通型,56,1,75.0,115.0,0,0,0,0,0,0,0,0,0,0,0,0,0,1,1,0,1,0,0,0,0,0,0,0,0,0,0,0,0,,0,0,7,0,,,2.0,1.0,3.0,0.0,1.0,,1.0
ZY010000229969,,普通型,55,1,79.0,146.0,1,0,0,0,0,0,0,0,0,0,0,0,0,1,1,0,0,0,0,0,0,0,0,0,0,0,0,0,0,,0,0,15,0,,,2.0,1.0,3.0,0.0,0.0,,2.0
ZY010000229972,,普通型,48,1,75.0,118.0,1,0,0,0,0,0,0,0,0,0,0,0,0,1,1,0,0,1,0,0,0,0,0,0,0,0,0,0,0,,0,0,14,0,,,1.0,1.0,3.0,1.0,0.0,,1.0
ZY010000229977,,普通型,45,1,79.0,110.0,1,0,0,1,0,0,0,0,0,0,0,0,0,1,0,0,0,1,0,0,0,0,0,1,0,0,0,0,0,,0,0,9,0,,,2.0,1.0,3.0,1.0,0.0,,2.0
ZY010000229982,,普通型,46,1,75.0,119.0,1,0,0,0,0,0,0,0,0,0,0,0,0,1,1,0,0,0,0,0,0,0,0,0,0,0,0,0,0,,0,0,7,0,,,,,,,,,
ZY010000229985,,普通型,42,0,64.0,103.0,1,0,0,0,0,0,0,0,0,0,0,0,0,1,0,0,0,1,0,0,1,0,1,0,0,1,0,0,0,,0,0,7,0,,,2.0,1.0,3.0,0.0,0.0,,3.0
ZY010000229987,,普通型,59,1,75.0,116.0,0,0,0,0,0,0,0,0,0,0,0,0,0,1,1,0,0,0,0,0,0,0,0,0,0,0,0,0,0,,0,0,9,0,,,2.0,1.0,3.0,0.0,1.0,,1.0
ZY010000229989,,普通型,55,0,75.0,119.0,1,0,0,0,0,0,0,0,0,1,0,0,0,1,1,0,0,0,0,0,1,0,0,0,0,0,0,0,0,,0,0,11,0,,,,,,,,,
ZY010000229990,,普通型,50,0,78.0,119.0,1,0,0,0,0,0,0,0,0,1,0,0,0,1,1,0,1,0,0,0,1,0,0,0,0,0,1,0,0,,0,0,20,0,,,2.0,1.0,2.0,0.0,0.0,,2.0
ZY010000229991,,普通型,51,1,75.0,115.0,1,0,1,0,0,0,0,0,0,0,0,0,0,1,1,0,0,0,0,0,0,0,0,0,0,0,0,0,0,,0,0,17,0,,,,,,,,,
ZY010000229996,,普通型,44,0,71.0,103.0,1,0,0,0,0,0,0,0,0,0,0,0,0,1,0,0,0,0,0,0,0,0,0,1,0,0,1,0,0,,0,0,7,0,,,2.0,1.0,1.0,0.0,0.0,,2.0
ZY010000229998,,普通型,70,1,80.0,120.0,1,0,0,0,0,1,0,0,0,0,0,0,0,1,1,0,0,0,0,0,0,0,0,0,0,0,0,0,0,,0,0,8,0,,,,,,,,,
6423098,,普通型,61,0,122.0,73.0,0,0,1,1,0,1,0,0,1,0,0,0,0,1,1,0,0,0,0,1,0,0,0,1,0,0,0,1,0,,0,0,36,0,,,,,,,,,
29124,死亡,危重型,79,1,120.0,80.0,0,0,0,0,0,0,0,0,0,0,0,0,0,0,0,0,0,0,0,0,0,0,0,0,0,0,0,0,0,,0,0,18,1,,1.0,1.0,1.0,1.0,0.0,0.0,1.0,3.0
590449-3,,重型,86,1,,,0,0,0,0,0,0,0,0,0,0,0,0,0,0,0,0,0,0,0,0,0,0,0,0,0,0,0,0,0,,0,0,60,0,,2.0,2.0,1.0,3.0,1.0,0.0,0.0,1.0
00419898,,轻型,61,1,,,0,0,0,1,0,1,0,0,0,0,0,0,0,1,0,0,0,0,0,0,0,0,0,0,0,0,0,0,0,,0,0,55,0,,,,,,,,,
79999,死亡,轻型,93,1,,,0,0,1,1,0,1,0,1,1,1,0,0,0,0,0,0,0,1,0,0,1,0,0,0,0,0,0,1,0,,0,0,34,1,,2.0,2.0,1.0,2.0,1.0,0.0,0.0,2.0
ZY010050402033,,重型,65,1,130.0,64.0,1,0,0,0,0,0,0,0,0,0,0,0,0,0,0,0,0,0,0,0,0,0,0,0,0,0,0,0,0,0.0,1,0,39,0,1.0,2.0,2.0,1.0,3.0,1.0,0.0,0.0,3.0
80028,好转,轻型,89,1,,,0,0,0,1,0,1,1,1,0,1,0,0,0,0,1,0,0,0,0,0,1,0,0,0,0,0,0,0,0,,0,0,37,0,,,1.0,0.0,2.0,,,,
6423269,死亡,重型,77,0,155.0,81.0,0,0,1,1,0,1,0,0,0,0,0,1,0,0,0,0,0,0,0,0,0,0,0,0,0,0,0,0,1,,0,0,33,1,,,,,,,,,
1622576,,危重型,63,0,135.0,72.0,0,0,0,0,0,0,0,0,0,0,0,0,0,1,1,0,0,1,0,0,1,0,0,0,0,0,0,0,0,,0,0,68,0,,2.0,2.0,1.0,2.0,1.0,0.0,0.0,3.0
ZY010000230053,,重型,42,0,99.0,123.0,1,0,0,0,0,0,0,0,0,0,0,0,0,1,1,0,0,0,0,0,0,0,0,0,0,0,0,0,0,,0,0,18,0,,,1.0,1.0,3.0,1.0,0.0,,1.0
1500,好转,普通型,75,0,106.0,81.0,0,0,0,0,0,0,1,0,0,0,0,0,0,0,0,0,0,0,0,0,0,0,0,0,0,0,0,0,0,,0,0,38,0,,1.0,2.0,0.0,2.0,1.0,0.0,0.0,3.0
ZY010000230058,,重型,40,1,74.0,125.0,1,0,0,0,0,0,0,0,0,0,0,0,0,1,1,0,0,0,0,0,0,0,0,0,0,0,0,0,0,,0,0,8,0,,,2.0,1.0,3.0,0.0,1.0,,2.0
ZY010000230060,,普通型,39,1,93.0,141.0,0,0,0,0,0,0,0,0,1,0,0,0,0,1,1,0,0,1,0,0,1,0,0,1,0,0,0,0,0,,0,0,18,0,,,2.0,1.0,3.0,1.0,0.0,,1.0
ZY010000230077,,普通型,31,0,71.0,104.0,0,0,0,0,0,0,0,0,0,0,0,0,0,1,1,0,0,0,0,0,0,0,0,0,0,0,0,0,0,,0,0,6,0,,,,,,,,,
ZY010000230079,,普通型,42,1,79.0,149.0,1,0,0,0,0,0,0,0,0,0,0,0,0,1,1,0,0,0,0,0,1,0,0,0,0,0,0,0,0,,0,0,9,0,,,,,,,,,
6423381,,普通型,38,1,126.0,68.0,1,1,1,0,1,0,0,0,0,1,1,0,0,1,1,0,0,0,0,0,1,0,0,1,0,0,0,1,0,,0,0,31,0,,,,,,,,,
ZY010000230092,,普通型,52,1,83.0,119.0,1,0,0,0,0,0,0,0,0,0,0,0,0,1,0,0,0,0,0,0,0,0,0,0,0,0,1,0,0,,0,0,14,0,,2.0,2.0,1.0,3.0,0.0,1.0,,3.0
ZY010000230098,,普通型,32,1,80.0,117.0,1,0,0,0,0,0,0,0,0,0,0,0,0,1,0,0,0,0,0,0,0,0,0,0,0,0,0,0,0,,0,0,6,0,,2.0,2.0,1.0,3.0,1.0,1.0,,3.0
ZY010000230099,,普通型,45,0,95.0,124.0,1,0,0,0,0,0,0,0,0,0,0,0,0,0,1,0,0,0,0,0,1,0,0,0,0,0,0,0,0,,0,0,6,0,,2.0,2.0,1.0,3.0,1.0,0.0,,2.0
ZY010000230107,,普通型,51,0,80.0,137.0,1,0,0,0,0,0,0,0,0,0,0,0,0,1,1,0,0,1,0,0,1,1,0,0,0,0,0,0,0,,0,0,14,0,,,1.0,1.0,3.0,0.0,0.0,,1.0
ZY010000230114,,普通型,22,0,92.0,128.0,0,0,0,0,0,0,0,0,0,0,0,0,0,1,0,0,0,1,0,0,1,0,0,0,0,0,0,0,0,,0,0,9,0,,,2.0,1.0,3.0,0.0,0.0,,2.0
ZY010000230115,,普通型,43,1,93.0,140.0,0,0,0,0,0,0,0,0,0,0,0,0,0,1,0,0,0,0,0,0,0,0,0,0,0,0,0,0,0,,0,0,13,0,,2.0,1.0,1.0,3.0,0.0,1.0,,
ZY010000230116,,普通型,27,1,65.0,124.0,1,0,0,0,0,0,0,0,0,0,0,0,0,1,1,0,0,1,0,0,0,0,0,0,0,0,0,0,0,,0,0,10,0,,,,,,,,,
ZY010000230119,死亡,重型,67,1,82.0,141.0,1,0,0,1,0,0,0,0,0,0,0,0,0,1,1,0,0,0,0,0,1,0,0,0,0,0,0,0,0,,0,0,19,1,,2.0,1.0,1.0,3.0,0.0,0.0,,2.0
ZY010000230121,,普通型,57,1,81.0,97.0,0,0,0,0,0,0,0,0,0,0,0,0,0,1,0,0,1,0,0,0,0,0,0,0,0,0,1,0,0,,0,0,20,0,,,,,,,,,
ZY010000230127,,普通型,52,1,78.0,111.0,1,0,0,0,0,0,0,0,0,0,0,0,0,1,1,0,0,1,0,0,1,0,0,0,0,0,0,0,0,,0,0,33,0,,,,,,,,,
ZY010000230128,,普通型,64,1,100.0,161.0,1,0,0,1,0,0,1,0,0,0,0,0,0,1,1,0,0,1,0,0,1,0,0,0,0,0,0,0,0,,0,0,27,0,,,,,,,,,
ZY010000230134,,普通型,53,1,89.0,128.0,1,0,0,0,0,0,0,0,0,0,0,0,0,1,1,0,0,1,0,0,1,0,0,0,0,0,0,0,0,,0,0,10,0,,,,,,,,,
ZY010000230138,,普通型,56,1,87.0,149.0,0,0,0,0,0,0,0,0,0,0,0,0,0,1,1,0,0,1,0,0,1,1,0,0,0,0,0,0,0,,0,0,19,0,,,2.0,1.0,3.0,1.0,0.0,,1.0
ZY010000230146,,普通型,24,1,57.0,125.0,0,0,0,0,0,0,0,0,0,0,0,0,0,1,1,0,0,1,0,0,1,0,0,0,0,0,0,0,0,,0,0,13,0,,,,,,,,,
ZY010000230148,,普通型,53,1,76.0,127.0,0,0,0,0,0,0,0,0,0,0,0,0,0,1,0,0,0,1,0,0,1,0,1,1,0,0,0,0,0,,0,0,14,0,,,1.0,1.0,3.0,0.0,1.0,,1.0
ZY010000230149,,普通型,52,0,79.0,110.0,0,0,0,0,0,0,0,0,0,0,0,0,0,1,1,0,0,1,0,0,1,0,1,0,0,0,0,0,0,,0,0,13,0,,,2.0,1.0,3.0,0.0,1.0,,1.0
ZY010000230156,,普通型,56,0,83.0,110.0,0,0,0,0,0,0,0,0,1,0,0,0,0,1,1,0,0,0,0,0,0,0,0,0,0,0,0,0,0,,0,0,18,0,,2.0,2.0,1.0,3.0,0.0,0.0,,3.0
1340723-1,,普通型,45,1,145.0,78.0,0,0,0,1,0,1,0,0,1,0,1,0,0,1,1,0,0,0,0,0,1,0,0,0,0,0,0,0,0,,0,0,21,0,,,2.0,1.0,3.0,1.0,0.0,0.0,1.0
1340681-1,,普通型,69,0,135.0,75.0,0,0,0,1,0,0,0,0,1,0,1,0,0,1,1,0,0,0,0,0,1,0,0,0,0,0,0,0,0,,0,0,9,0,,,2.0,1.0,3.0,0.0,0.0,0.0,
1340719-1,,普通型,34,1,115.0,68.0,0,0,0,1,0,1,0,0,1,0,1,0,0,1,1,0,0,0,0,0,1,0,0,0,0,0,0,0,0,,0,0,13,0,,,2.0,1.0,3.0,1.0,0.0,0.0,1.0
ZY010000230164,,轻型,39,1,77.0,134.0,0,0,0,0,0,0,0,0,0,0,0,0,0,1,1,0,0,1,0,0,0,0,1,0,0,0,0,0,0,,0,0,17,0,,,,,,,,,
ZY010000230167,,普通型,45,1,62.0,125.0,0,0,0,0,0,0,0,0,0,0,0,0,0,1,1,0,0,1,0,0,0,0,1,0,0,0,0,0,0,,0,0,11,0,,,2.0,1.0,3.0,1.0,0.0,,1.0
ZY010000230171,,普通型,55,0,79.0,123.0,1,0,0,1,0,0,0,0,0,1,0,0,0,1,1,0,0,1,0,0,1,0,0,0,0,0,0,0,0,,0,0,1,0,,,,,,,,,
1622752,,危重型,67,0,124.0,72.0,0,0,0,0,0,0,0,0,0,0,0,0,0,0,0,0,0,0,0,0,0,0,0,0,0,0,0,0,0,,0,0,81,0,,3.0,1.0,1.0,1.0,0.0,0.0,,3.0
9048810818,,重型,76,1,200.0,100.0,0,0,0,0,0,0,0,0,0,0,0,0,0,0,0,0,0,0,0,0,0,0,0,0,0,0,0,0,0,,0,0,0,0,,2.0,1.0,0.0,2.0,1.0,0.0,,3.0
352728261,,普通型,40,1,150.0,90.0,0,0,0,0,0,0,0,0,0,0,0,0,0,0,0,0,0,0,0,0,0,0,0,0,0,0,0,0,0,,0,0,0,0,,2.0,1.0,1.0,3.0,1.0,1.0,0.0,1.0
1620,其他,普通型,53,1,125.0,83.0,0,0,0,1,0,0,0,0,0,0,1,1,0,1,0,0,0,0,0,0,0,0,0,1,0,0,1,1,0,,0,0,15,0,,2.0,2.0,1.0,3.0,1.0,0.0,0.0,2.0
452929,,重型,67,0,125.0,80.0,0,0,0,1,0,1,0,0,0,0,0,0,0,0,0,0,0,0,0,0,1,0,0,0,0,0,0,0,0,,0,0,67,0,,1.0,2.0,1.0,3.0,1.0,1.0,0.0,1.0
89726969413,,轻型,74,0,140.0,70.0,0,0,0,0,0,0,0,0,0,0,0,0,0,0,0,0,0,0,0,0,0,0,0,0,0,0,0,0,0,,0,0,0,0,,2.0,2.0,1.0,3.0,1.0,0.0,0.0,3.0
6423616,,普通型,39,0,118.0,63.0,0,0,0,0,0,0,1,0,0,0,0,0,0,0,0,0,0,0,0,0,0,0,0,0,0,0,0,1,0,,0,0,34,0,,,,,,,,,
79000039524,,普通型,90,0,131.0,60.0,0,0,0,0,0,0,0,0,0,0,0,0,0,0,0,0,0,0,0,0,0,0,0,0,0,0,0,0,0,,0,0,0,0,,2.0,2.0,1.0,2.0,1.0,0.0,0.0,3.0
29305,死亡,危重型,73,1,120.0,80.0,0,0,0,1,0,0,0,0,0,0,0,0,0,0,0,0,0,1,0,0,1,0,0,0,0,0,0,0,0,4.0,1,0,14,1,3.0,,1.0,0.0,3.0,0.0,0.0,0.0,1.0
1340817-1,,普通型,64,1,122.0,69.0,0,1,0,1,0,0,0,0,0,0,0,0,0,1,1,0,1,0,0,0,0,0,0,0,0,0,1,0,0,,0,0,19,0,,2.0,2.0,1.0,3.0,1.0,0.0,0.0,1.0
6423657,死亡,危重型,96,0,130.0,60.0,0,0,0,1,0,0,0,1,0,0,0,0,0,1,1,0,0,0,0,0,0,0,0,0,0,0,0,0,1,,1,0,41,1,,3.0,2.0,1.0,2.0,1.0,0.0,1.0,2.0
29326,,普通型,54,1,130.0,80.0,0,0,0,0,0,0,0,0,0,0,0,0,0,0,0,0,0,0,0,0,0,0,0,0,0,0,0,0,0,,0,0,4,0,,2.0,2.0,1.0,3.0,0.0,0.0,0.0,1.0
6423691,,普通型,42,0,112.0,63.0,0,0,0,0,0,0,0,0,0,0,0,0,0,1,1,0,0,1,0,0,1,0,0,1,0,0,0,1,0,,0,0,33,0,,,,,,,,,
ZY010000230339,死亡,重型,70,1,72.0,122.0,1,1,0,0,0,0,0,0,0,0,0,0,0,1,1,0,0,1,0,0,1,0,0,0,0,0,0,0,1,,0,0,11,1,,,,,,,,,
ZY010000230346,,普通型,57,0,80.0,145.0,0,0,0,0,0,0,0,0,0,1,0,0,0,1,1,0,0,0,0,0,1,0,0,0,0,0,0,0,0,,0,0,17,0,,,,,,,,,
29337,,普通型,51,1,110.0,80.0,0,0,0,0,0,0,0,0,0,0,0,0,0,0,0,0,0,0,0,0,0,0,0,0,0,0,0,0,0,,0,0,5,0,,2.0,2.0,1.0,3.0,0.0,0.0,0.0,1.0
ZY010000230349,死亡,危重型,42,1,80.0,122.0,1,0,0,0,0,0,0,0,0,1,0,0,0,1,0,0,0,1,0,0,1,0,0,0,0,0,0,0,0,,0,0,24,1,,,,,,,,,
29348,,普通型,43,1,130.0,80.0,0,0,0,1,0,0,0,0,0,0,0,0,0,0,0,0,0,0,0,0,0,0,0,0,0,0,0,0,0,,0,0,4,0,,1.0,2.0,1.0,3.0,1.0,0.0,0.0,1.0
29354,,普通型,45,1,80.0,80.0,0,0,0,0,0,0,0,0,0,0,0,0,0,0,0,0,0,0,0,0,0,0,0,0,0,0,0,0,0,,0,0,4,0,,2.0,2.0,1.0,3.0,1.0,1.0,0.0,2.0
1622987,,普通型,80,1,124.0,66.0,0,0,0,1,0,1,0,1,0,0,0,0,0,1,1,0,0,1,0,0,1,1,1,1,0,0,0,1,0,,0,0,31,0,,,,,,,,,
ZY010000230361,,普通型,58,1,72.0,133.0,1,1,0,1,0,0,0,0,1,0,0,0,0,1,1,0,1,0,0,0,1,0,0,0,0,0,1,0,0,,0,0,10,0,,,2.0,1.0,3.0,0.0,0.0,,2.0
ZY010000230363,,普通型,49,1,99.0,155.0,1,0,0,0,0,0,0,0,0,0,0,0,0,1,0,0,1,0,0,0,0,0,0,0,0,0,0,0,0,,0,0,12,0,,,2.0,1.0,3.0,0.0,0.0,,1.0
ZY010000230365,,普通型,52,0,67.0,109.0,0,0,0,0,0,0,0,0,0,0,0,0,0,1,1,0,0,0,0,0,0,0,0,1,0,0,0,0,0,,0,0,8,0,,,,,,,,,
ZY010000230386,,普通型,58,0,82.0,120.0,0,0,0,0,0,0,0,0,0,0,0,0,0,1,1,0,0,0,0,0,1,0,0,0,0,0,0,0,0,,0,0,17,0,,,2.0,1.0,3.0,0.0,0.0,,2.0
ZY010000230387,死亡,危重型,68,1,93.0,178.0,0,0,0,0,0,0,0,0,0,0,0,0,0,1,0,0,0,1,0,0,1,0,1,1,0,0,0,0,1,,0,0,3,1,,2.0,1.0,1.0,3.0,0.0,1.0,,3.0
29358,,普通型,59,1,125.0,75.0,0,0,0,0,0,0,0,0,0,0,0,0,0,0,0,0,0,0,0,0,0,0,0,0,0,0,0,0,0,,0,0,11,0,,2.0,2.0,1.0,3.0,0.0,0.0,0.0,
1707,好转,普通型,73,0,150.0,80.0,0,0,1,1,0,1,0,0,0,0,0,0,0,0,0,0,0,0,0,0,0,0,0,0,0,0,0,0,0,,0,0,30,0,,,2.0,1.0,2.0,1.0,0.0,0.0,1.0
ZY010000230395,,普通型,61,1,82.0,127.0,1,0,0,1,0,0,0,0,0,0,0,0,0,1,0,0,0,0,0,0,0,0,0,0,0,0,0,0,0,,0,0,23,0,,,2.0,1.0,3.0,1.0,1.0,,1.0
ZY010000230396,,普通型,41,1,79.0,118.0,0,0,0,0,0,0,0,0,0,0,0,0,0,1,1,0,0,1,0,0,1,0,1,0,0,0,0,0,0,,0,0,14,0,,,1.0,1.0,3.0,0.0,0.0,,2.0
451593,死亡,重型,67,1,139.0,88.0,1,1,0,0,0,0,0,0,0,1,0,0,0,0,0,0,0,0,0,0,0,0,0,0,0,1,0,0,0,,0,0,31,1,,3.0,1.0,1.0,1.0,0.0,0.0,0.0,3.0